{"text_format":"1","workbook":"xlsx","n_sheets":10,"sheets":["PA Form","Union Code","Job Code","HR Account Info","Action Reason","Class","Type","Dept","Location","Pay"],"not_rendered":{"charts":0,"images":1,"macros":1,"external_links":0,"defined_names":14,"comments":1,"pivot_tables":0},"unopened":[],"bounds":{"document_bytes":16777216,"sheet_cells":100000,"rows_first":2000,"rows_last":500,"rows_between":2000,"halvings":0,"cell_chars":16384,"cell_head_chars":4096},"cells_cut":0,"cells_raw":0,"read":"whole","date_system":"1900"}

{"sheet":"PA Form","index":0,"n_rows":70,"n_cols":25,"rows_kept":70,"cut":false,"hidden":false,"merged":[[34,8,34,11],[34,17,34,18],[0,0,19,0],[20,0,54,0],[18,6,18,7],[49,2,49,3],[51,2,51,3],[23,5,23,6],[2,4,2,12],[23,2,23,3],[20,1,21,1],[25,8,25,11],[30,5,30,6],[27,8,27,11],[28,8,28,11],[29,8,29,11],[25,2,25,3],[36,2,36,3],[42,2,42,3],[43,5,43,6],[42,5,42,6],[37,1,37,13],[43,8,43,11],[48,5,48,6],[43,2,43,3],[41,2,41,3],[44,2,44,3],[45,2,45,3],[38,8,38,11],[38,2,38,3],[41,5,41,6],[40,5,40,6],[40,2,40,3],[39,2,39,3],[42,8,42,11],[39,5,39,6],[44,8,44,11],[45,5,45,6],[44,5,44,6],[38,5,38,6],[41,8,41,11],[39,8,39,11],[45,8,45,11],[54,17,54,18],[63,1,63,5],[56,4,59,23],[65,6,65,7],[63,6,63,7],[63,22,63,24],[61,17,61,20],[61,23,61,24],[65,22,65,24],[63,16,63,21],[61,12,61,13],[65,16,65,21],[61,5,61,7],[55,0,67,0],[52,2,52,3],[65,1,65,5],[52,5,52,6],[53,1,53,13],[65,9,65,13],[46,15,46,16],[63,9,63,13],[61,14,61,16],[53,15,53,16],[47,15,47,16],[61,8,61,11],[54,15,54,16],[46,8,46,11],[46,2,46,3],[47,2,47,3],[51,5,51,6],[52,8,52,11],[48,8,48,11],[50,2,50,3],[49,5,49,6],[49,8,49,11],[50,8,50,11],[50,5,50,6],[53,17,53,18],[51,17,51,18],[45,17,45,18],[44,17,44,18],[49,15,49,16],[48,15,48,16],[52,21,52,22],[51,19,51,20],[45,19,45,20],[52,15,52,16],[47,17,47,18],[48,17,48,18],[50,15,50,16],[44,15,44,16],[51,15,51,16],[45,15,45,16],[50,19,50,20],[48,21,48,22],[51,21,51,22],[46,21,46,22],[46,17,46,18],[53,19,53,22],[48,2,48,3],[42,15,42,16],[52,23,52,24],[50,23,50,24],[49,23,49,24],[48,23,48,24],[44,19,44,20],[43,19,43,20],[46,19,46,20],[52,19,52,20],[52,17,52,18],[45,23,45,24],[46,23,46,24],[43,17,43,18],[51,23,51,24],[48,19,48,20],[47,19,47,20],[49,19,49,20],[47,23,47,24],[43,15,43,16],[47,8,47,11],[47,5,47,6],[46,5,46,6],[51,8,51,11],[25,23,25,24],[33,19,33,20],[42,17,42,18],[42,19,42,20],[50,17,50,18],[49,17,49,18],[41,17,41,18],[41,19,41,20],[27,23,27,24],[31,21,31,22],[27,21,27,22],[38,21,38,22],[40,21,40,22],[38,23,38,24],[49,21,49,22],[50,21,50,22],[43,21,43,22],[41,21,41,22],[42,21,42,22],[47,21,47,22],[44,21,44,22],[45,21,45,22],[39,19,39,20],[26,17,26,18],[0,22,0,24],[24,19,24,20],[0,19,0,21],[20,19,20,22],[24,23,24,24],[23,17,23,18],[23,19,23,20],[4,17,4,19],[22,23,22,24],[22,21,22,22],[22,19,22,20],[23,21,23,22],[14,15,14,19],[16,19,16,21],[2,14,2,24],[12,8,12,15],[23,15,23,16],[24,15,24,16],[24,8,24,11],[24,21,24,22],[8,3,8,8],[10,3,10,8],[24,2,24,3],[22,15,22,16],[25,21,25,22],[25,19,25,20],[29,21,29,22],[29,2,29,3],[31,5,31,6],[26,5,26,6],[25,5,25,6],[31,2,31,3],[26,8,26,11],[26,21,26,22],[28,15,28,16],[31,8,31,11],[30,8,30,11],[28,19,28,20],[28,17,28,18],[27,15,27,16],[27,17,27,18],[28,2,28,3],[25,15,25,16],[26,15,26,16],[24,17,24,18],[33,5,33,6],[32,17,32,18],[27,2,27,3],[26,2,26,3],[22,5,22,6],[32,8,32,11],[29,15,29,16],[28,5,28,6],[27,5,27,6],[29,5,29,6],[33,15,33,16],[32,5,32,6],[22,2,22,3],[40,19,40,20],[39,21,39,22],[37,19,37,22],[32,2,32,3],[32,19,32,20],[32,21,32,22],[35,2,35,3],[34,2,34,3],[22,17,22,18],[27,19,27,20],[26,19,26,20],[30,2,30,3],[31,15,31,16],[32,15,32,16],[24,5,24,6],[36,17,36,18],[37,15,37,16],[37,17,37,18],[36,19,36,20],[33,2,33,3],[23,8,23,11],[22,8,22,11],[25,17,25,18],[33,8,33,11],[43,23,43,24],[44,23,44,24],[36,5,36,6],[29,19,29,20],[31,17,31,18],[33,17,33,18],[30,19,30,20],[31,19,31,20],[39,23,39,24],[41,15,41,16],[38,15,38,16],[42,23,42,24],[41,23,41,24],[40,23,40,24],[38,19,38,20],[40,17,40,18],[40,8,40,11],[38,17,38,18],[40,15,40,16],[34,5,34,6],[35,5,35,6],[39,17,39,18],[36,15,36,16],[39,15,39,16],[28,23,28,24],[36,23,36,24],[23,23,23,24],[29,23,29,24],[28,21,28,22],[26,23,26,24],[30,21,30,22],[30,23,30,24],[36,8,36,11],[32,23,32,24],[31,23,31,24],[36,21,36,22],[33,23,33,24],[33,21,33,22],[35,21,35,22],[34,15,34,16],[34,19,34,20],[35,8,35,11],[35,15,35,16],[35,17,35,18],[35,19,35,20],[29,17,29,18],[30,17,30,18],[30,15,30,16],[4,8,4,11],[4,12,4,13],[9,22,9,23],[10,22,10,23],[12,22,12,23],[20,23,21,24],[7,22,7,23],[14,21,14,23],[21,21,21,22],[18,17,18,19],[18,22,18,23],[4,1,4,4],[20,15,21,16],[14,4,14,5],[16,11,16,12],[16,4,16,6],[4,23,4,24],[14,8,14,9],[12,4,12,5],[20,13,21,13],[20,2,21,3],[20,5,21,6],[20,7,21,7],[20,8,21,11],[20,4,21,4],[20,17,21,18],[20,12,21,12],[20,14,21,14],[6,22,6,24],[21,19,21,20],[8,22,8,23],[8,11,8,16],[10,11,10,16],[18,8,18,12],[4,5,4,7]]}
["Section 1",null,null,null,null,null,null,null,null,null,null,null,"University of Massachusetts Medical School",null,null,null,null,null,null,"Date filled in:",null,null,{"$f":"TODAY()","v":"2021-04-23"}]
[null,null,null,null,null,null,null,null,null,null,null,null,"Personnel Action Form"]
[null,null,null,null,"Gray shaded fields are formulas and will fill in automatically.",null,null,null,null,null,null,null,null,null,"If this person is on a VISA, please contact Immigration Services before making any changes"]
[]
[null,"     1. Employee Name:",null,null,null,null,null,null,null,null,null,null,null,null,"         2.  Employee ID:",null,null,null,null,null,"2a.","Requisition #:"]
[null,null,null,null,null,"       Last Name",null,null,"    First Name",null,null,null,"          Middle Initial"]
[null,null,null,null,null,null,null,null,null,null,null,null,null,null,null,null,null,null,null,null,null,null," "]
[null,null,"3.","Action Code/Action Reason   Choose all applicable actions",null,null,null,null,null,null,null,null,null,null,null,null,null,null,"4.  Effective Begin Date"]
[null,null,"A.",null,null,null,null,null,null,null,"C.",null,null,null,null,null,null,null,"5.  Effective End Date"]
[null,null,null,null,null,null,null,null,null,null,null,null,null,null,null,null,null,null,"6.  Expected Return Date"]
[null,null,"B.",null,null,null,null,null,null,null,"D.",null,null,null,null,null,null,null,"7.  Position Number"]
[]
[null," 8. Job Code:",null,null,null,null,"          9. Job Title:",null,{"$f":"IFERROR(VLOOKUP(E13,'Job Code'!A1:E5717,2,FALSE), 0)","v":0},null,null,null,null,null,null,null,"10. Grade:",{"$f":"IFERROR(VLOOKUP(E13,'Job Code'!A1:E5772,3,FALSE), 0)","v":0},"11. Step:",null,"  12. Class:"]
[]
[null," 13. Emp. Type:",null,null,null,null,"14. Weekly Hours:",null,null,null,"  15. FTE:",null,{"$f":"I15/40","v":0},"  16. Home Dept.:",null,null,null,null,null,null,"17. Loc:"]
[]
[null,"18. Union Code:",null,null,null,null,null,"  19. Pay Frequency:",null,null,null,null,null,"  20. Leased",null,null,"21. Annual Rate Change:",null,null,{"$f":"IF(R19>0,W19-G19,0)","v":0},null,null,null,{"$f":"IF(AND(G19>0,R19=\"\"),\"0%\",(T17/G19))","v":{"$error":"#DIV/0!"}}]
[]
[null,"  22. Curr. Annual Rate: Base",null,null,null,null,null,null,null,null,null,null,null,"        23. New Annual Rate:   Base:",null,null,null,null,null,null,null,null,{"$f":"IF(AND(R19<>G19,R19<>0),R19, 0)","v":0}]
[]
["Section 2",null,"24.\nHR Acct\nCode",null,"25.\nFund","26.\nDepartment ID",null,"27.\nProgram","28.\nProject /\nGrant",null,null,null,"29.\nClass","30.\nEarn Code","31.\nChart\nString\n% Split","32.\nComp Rate\nBi-Weekly\n or Hourly",null,"33.\nAnnual \nRate",null,"34.\nEncumbrance Exceptions"]
[null,null,null,null,null,null,null,null,null,null,null,null,null,null,null,null,null,null,null,"End Date",null,"Fixed Amt."]
[null,"a",null,null,{"$f":"IFERROR(VLOOKUP(C23,'HR Account Info'!$A$2:$F$9702,2,FALSE),0)","v":0},{"$f":"IFERROR(VLOOKUP(C23,'HR Account Info'!$A$2:$F$9702,3,FALSE),0)","v":0},{"$f":"IF($C23<>0,IF(LEFT(#REF!,2)=\"No\",\"#####\",#REF!),\"\")","v":""},{"$f":"IFERROR(VLOOKUP(C23,'HR Account Info'!$A$2:$F$9702,4,FALSE),0)","v":0},{"$f":"IFERROR(VLOOKUP(C23,'HR Account Info'!$A$2:$F$9702,5,FALSE),0)","v":0},{"$f":"IF($C23<>0,IF(LEFT(#REF!,2)=\"No\",\"#####\",#REF!),\"\")","v":""},{"$f":"IF($C23<>0,IF(LEFT(#REF!,2)=\"No\",\"#####\",#REF!),\"\")","v":""},{"$f":"IF($C23<>0,IF(LEFT(#REF!,2)=\"No\",\"#####\",#REF!),\"\")","v":""},{"$f":"IFERROR(VLOOKUP(C23,'HR Account Info'!$A$2:$F$9702,6,FALSE),0)","v":0},null,null,{"$f":"IF(O23=\"\",0,(IF(L$17=\"hourly\",(G$19+T$17)/(2080*M$15),IF(L$17=\"Bi-Weekly\",(G$19+$T$17)/26)*O23)))","v":0},null,{"$f":"(G$19+T$17)*O23","v":0}]
[null,"b",null,null,{"$f":"IFERROR(VLOOKUP(C24,'HR Account Info'!$A$2:$F$9702,2,FALSE),0)","v":0},{"$f":"IFERROR(VLOOKUP(C24,'HR Account Info'!$A$2:$F$9702,3,FALSE),0)","v":0},{"$f":"IF($C24<>0,IF(LEFT(#REF!,2)=\"No\",\"#####\",#REF!),\"\")","v":""},{"$f":"IFERROR(VLOOKUP(C24,'HR Account Info'!$A$2:$F$9702,4,FALSE),0)","v":0},{"$f":"IFERROR(VLOOKUP(C24,'HR Account Info'!$A$2:$F$9702,5,FALSE),0)","v":0},{"$f":"IF($C24<>0,IF(LEFT(#REF!,2)=\"No\",\"#####\",#REF!),\"\")","v":""},{"$f":"IF($C24<>0,IF(LEFT(#REF!,2)=\"No\",\"#####\",#REF!),\"\")","v":""},{"$f":"IF($C24<>0,IF(LEFT(#REF!,2)=\"No\",\"#####\",#REF!),\"\")","v":""},{"$f":"IFERROR(VLOOKUP(C24,'HR Account Info'!$A$2:$F$9702,6,FALSE),0)","v":0},null,null,{"$f":"IF(O24=\"\",0,(IF(L$17=\"hourly\",(G$19+T$17)/(2080*M$15),IF(L$17=\"Bi-Weekly\",(G$19+$T$17)/26)*O24)))","v":0},null,{"$f":"(G$19+T$17)*O24","v":0}]
[null,"c",null,null,{"$f":"IFERROR(VLOOKUP(C25,'HR Account Info'!$A$2:$F$9702,2,FALSE),0)","v":0},{"$f":"IFERROR(VLOOKUP(C25,'HR Account Info'!$A$2:$F$9702,3,FALSE),0)","v":0},{"$f":"IF($C25<>0,IF(LEFT(#REF!,2)=\"No\",\"#####\",#REF!),\"\")","v":""},{"$f":"IFERROR(VLOOKUP(C25,'HR Account Info'!$A$2:$F$9702,4,FALSE),0)","v":0},{"$f":"IFERROR(VLOOKUP(C25,'HR Account Info'!$A$2:$F$9702,5,FALSE),0)","v":0},{"$f":"IF($C25<>0,IF(LEFT(#REF!,2)=\"No\",\"#####\",#REF!),\"\")","v":""},{"$f":"IF($C25<>0,IF(LEFT(#REF!,2)=\"No\",\"#####\",#REF!),\"\")","v":""},{"$f":"IF($C25<>0,IF(LEFT(#REF!,2)=\"No\",\"#####\",#REF!),\"\")","v":""},{"$f":"IFERROR(VLOOKUP(C25,'HR Account Info'!$A$2:$F$9702,6,FALSE),0)","v":0},null,null,0,null,0]
[null,"d",null,null,{"$f":"IFERROR(VLOOKUP(C26,'HR Account Info'!$A$2:$F$9702,2,FALSE),0)","v":0},{"$f":"IFERROR(VLOOKUP(C26,'HR Account Info'!$A$2:$F$9702,3,FALSE),0)","v":0},{"$f":"IF($C26<>0,IF(LEFT(#REF!,2)=\"No\",\"#####\",#REF!),\"\")","v":""},{"$f":"IFERROR(VLOOKUP(C26,'HR Account Info'!$A$2:$F$9702,4,FALSE),0)","v":0},{"$f":"IFERROR(VLOOKUP(C26,'HR Account Info'!$A$2:$F$9702,5,FALSE),0)","v":0},{"$f":"IF($C26<>0,IF(LEFT(#REF!,2)=\"No\",\"#####\",#REF!),\"\")","v":""},{"$f":"IF($C26<>0,IF(LEFT(#REF!,2)=\"No\",\"#####\",#REF!),\"\")","v":""},{"$f":"IF($C26<>0,IF(LEFT(#REF!,2)=\"No\",\"#####\",#REF!),\"\")","v":""},{"$f":"IFERROR(VLOOKUP(C26,'HR Account Info'!$A$2:$F$9702,6,FALSE),0)","v":0},null,null,0,null,0]
[null,"e",null,null,{"$f":"IFERROR(VLOOKUP(C27,'HR Account Info'!$A$2:$F$9702,2,FALSE),0)","v":0},{"$f":"IFERROR(VLOOKUP(C27,'HR Account Info'!$A$2:$F$9702,3,FALSE),0)","v":0},{"$f":"IF($C27<>0,IF(LEFT(#REF!,2)=\"No\",\"#####\",#REF!),\"\")","v":""},{"$f":"IFERROR(VLOOKUP(C27,'HR Account Info'!$A$2:$F$9702,4,FALSE),0)","v":0},{"$f":"IFERROR(VLOOKUP(C27,'HR Account Info'!$A$2:$F$9702,5,FALSE),0)","v":0},{"$f":"IF($C27<>0,IF(LEFT(#REF!,2)=\"No\",\"#####\",#REF!),\"\")","v":""},{"$f":"IF($C27<>0,IF(LEFT(#REF!,2)=\"No\",\"#####\",#REF!),\"\")","v":""},{"$f":"IF($C27<>0,IF(LEFT(#REF!,2)=\"No\",\"#####\",#REF!),\"\")","v":""},{"$f":"IFERROR(VLOOKUP(C27,'HR Account Info'!$A$2:$F$9702,6,FALSE),0)","v":0},null,null,0,null,0]
[null,"f",null,null,{"$f":"IFERROR(VLOOKUP(C28,'HR Account Info'!$A$2:$F$9702,2,FALSE),0)","v":0},{"$f":"IFERROR(VLOOKUP(C28,'HR Account Info'!$A$2:$F$9702,3,FALSE),0)","v":0},{"$f":"IF($C28<>0,IF(LEFT(#REF!,2)=\"No\",\"#####\",#REF!),\"\")","v":""},{"$f":"IFERROR(VLOOKUP(C28,'HR Account Info'!$A$2:$F$9702,4,FALSE),0)","v":0},{"$f":"IFERROR(VLOOKUP(C28,'HR Account Info'!$A$2:$F$9702,5,FALSE),0)","v":0},{"$f":"IF($C28<>0,IF(LEFT(#REF!,2)=\"No\",\"#####\",#REF!),\"\")","v":""},{"$f":"IF($C28<>0,IF(LEFT(#REF!,2)=\"No\",\"#####\",#REF!),\"\")","v":""},{"$f":"IF($C28<>0,IF(LEFT(#REF!,2)=\"No\",\"#####\",#REF!),\"\")","v":""},{"$f":"IFERROR(VLOOKUP(C28,'HR Account Info'!$A$2:$F$9702,6,FALSE),0)","v":0},null,null,0,null,0]
[null,"g",null,null,{"$f":"IFERROR(VLOOKUP(C29,'HR Account Info'!$A$2:$F$9702,2,FALSE),0)","v":0},{"$f":"IFERROR(VLOOKUP(C29,'HR Account Info'!$A$2:$F$9702,3,FALSE),0)","v":0},{"$f":"IF($C29<>0,IF(LEFT(#REF!,2)=\"No\",\"#####\",#REF!),\"\")","v":""},{"$f":"IFERROR(VLOOKUP(C29,'HR Account Info'!$A$2:$F$9702,4,FALSE),0)","v":0},{"$f":"IFERROR(VLOOKUP(C29,'HR Account Info'!$A$2:$F$9702,5,FALSE),0)","v":0},{"$f":"IF($C29<>0,IF(LEFT(#REF!,2)=\"No\",\"#####\",#REF!),\"\")","v":""},{"$f":"IF($C29<>0,IF(LEFT(#REF!,2)=\"No\",\"#####\",#REF!),\"\")","v":""},{"$f":"IF($C29<>0,IF(LEFT(#REF!,2)=\"No\",\"#####\",#REF!),\"\")","v":""},{"$f":"IFERROR(VLOOKUP(C29,'HR Account Info'!$A$2:$F$9702,6,FALSE),0)","v":0},null,null,0,null,0]
[null,"h",null,null,{"$f":"IFERROR(VLOOKUP(C30,'HR Account Info'!$A$2:$F$9702,2,FALSE),0)","v":0},{"$f":"IFERROR(VLOOKUP(C30,'HR Account Info'!$A$2:$F$9702,3,FALSE),0)","v":0},{"$f":"IF($C30<>0,IF(LEFT(#REF!,2)=\"No\",\"#####\",#REF!),\"\")","v":""},{"$f":"IFERROR(VLOOKUP(C30,'HR Account Info'!$A$2:$F$9702,4,FALSE),0)","v":0},{"$f":"IFERROR(VLOOKUP(C30,'HR Account Info'!$A$2:$F$9702,5,FALSE),0)","v":0},{"$f":"IF($C30<>0,IF(LEFT(#REF!,2)=\"No\",\"#####\",#REF!),\"\")","v":""},{"$f":"IF($C30<>0,IF(LEFT(#REF!,2)=\"No\",\"#####\",#REF!),\"\")","v":""},{"$f":"IF($C30<>0,IF(LEFT(#REF!,2)=\"No\",\"#####\",#REF!),\"\")","v":""},{"$f":"IFERROR(VLOOKUP(C30,'HR Account Info'!$A$2:$F$9702,6,FALSE),0)","v":0},null,null,0,null,0]
{"$rows_left_out":41}
{"sheet":"Union Code","index":1,"n_rows":11,"n_cols":1,"rows_kept":11,"cut":false,"hidden":true,"merged":[]}
["Union Code"]
["W00 Non-Benefited"]
["W20 AFSCME Trades and Building Svc"]
["W21 NEPBA Police"]
["W22 MNA"]
["W23 NEPBA Police Sergeants"]
["W25 Non-Unit Classified"]
["W28 SHARE"]
["W50 NAGE Admin and Professional"]
["W60 Non-Unit Professional"]
["W63 Residents/Post Docs"]

{"sheet":"Job Code","index":2,"n_rows":1706,"n_cols":5,"rows_kept":1706,"cut":false,"hidden":true,"merged":[]}
["Job Code","Descr","Grade","Union Code","Descr"]
["02T53","Administrative Support",null,"W00","Non-Benefited"]
["GF111","LEND Fellow",null,"W00","Non-Benefited"]
["GF112","PIHC Scholar",null,"W00","Non-Benefited"]
["GR100","UMass Graduate Student",null,"W00","Non-Benefited"]
["GR101","Non UMass Graduate Student",null,"W00","Non-Benefited"]
["GR102","PREP Graduate Student",null,"W00","Non-Benefited"]
["MA0007","Coord, Residency Prog","15","W28","SHARE"]
["MA0016","Library Asst 1A","16","W28","SHARE"]
["MA0023","Coord, Clerkship Education","41","W60","Non-Unit Professional"]
["MA0034","Specialist, Access Control","15","W28","SHARE"]
["MA0043","Coord,Residency Prog II","17","W28","SHARE"]
["MA0044","Residency Program Admin I","41","W60","Non-Unit Professional"]
["MA0048","Security and Safety Aide","11","W20","AFSCME Trades and Building Svc"]
["MB0003","Content Producer","43","W60","Non-Unit Professional"]
["MB0004","Coord, Educational","42","W60","Non-Unit Professional"]
["MB0006","Purchasing Agent I","41","W60","Non-Unit Professional"]
["MB0007","Content Editor","45","W60","Non-Unit Professional"]
["MB0008","Director, Annual Fund","47","W60","Non-Unit Professional"]
["MB0010","Spec,Protocol","43","W60","Non-Unit Professional"]
["MB0011","Institutional Repos Librarian","45","W60","Non-Unit Professional"]
["MB0014","News Media Producer","45","W60","Non-Unit Professional"]
["MB0015","Regulatory Spec","43","W60","Non-Unit Professional"]
["MB0023","Space Utilization Specialist","42","W60","Non-Unit Professional"]
["MB0024","Clinical Research Navigator","45","W60","Non-Unit Professional"]
["MB0025","Assoc Dir Str Growth & Bus Dev","48","W60","Non-Unit Professional"]
["MB0028","Practice/Health Sys Transf Spc","47","W60","Non-Unit Professional"]
["MB0031","Assoc Dir, China Program","47","W60","Non-Unit Professional"]
["MB0032","Sr Video Producer","44","W60","Non-Unit Professional"]
["MB0034","Mgr, Lib Edu & Clinical Svcs","46","W60","Non-Unit Professional"]
{"$rows_left_out":1677}
{"sheet":"HR Account Info","index":3,"n_rows":7058,"n_cols":6,"rows_kept":7058,"cut":false,"hidden":true,"merged":[]}
["HR Acct Code","Fund","Dept","Program","Project","Class"]
["W100025","52030","W100000000","F00","",""]
["W102526","52132","W404010000","B05","",""]
["W102528","52132","W402400000","B05","",""]
["W102531","52132","W824000000","B05","",""]
["W102532","52132","W821900000","B05","",""]
["W102533","52132","W710000000","B05","",""]
["W102535","52132","W824700000","B05","",""]
["W102537","52132","W407500000","B05","",""]
["W102538","52132","W833000000","B05","",""]
["W102539","52132","W833500000","B05","",""]
["W102540","52132","W404500000","B05","",""]
["W102541","52132","W822900000","B05","",""]
["W102542","52132","W710010000","B05","",""]
["W102543","52132","W710035000","B05","",""]
["W102544","52132","W710040000","B05","",""]
["W102545","52132","W710045000","B05","",""]
["W102546","52132","W710060000","B05","",""]
["W102547","52132","W710075000","B05","",""]
["W102548","52132","W710080000","B05","",""]
["W102549","52132","W710085000","B05","",""]
["W102550","52132","W832500000","B05","",""]
["W102552","52132","W822500000","B05","",""]
["W102553","52132","W825500000","B05","",""]
["W102555","52132","W710025000","B05","",""]
["W102560","52132","W710020000","B05","",""]
["W102561","52132","W404011000","B05","",""]
["W102562","52132","W419000000","B05","",""]
["W102563","52132","W419100000","B05","",""]
["W102565","52132","W400900000","B05","",""]
{"$rows_left_out":7029}
{"sheet":"Action Reason","index":4,"n_rows":101,"n_cols":1,"rows_kept":101,"cut":false,"hidden":true,"merged":[]}
["Most Frequently Used:"]
["Funding Change"]
["Encumbrance Change Only"]
["Change In Time (Change to FTE - Work Schedule required)"]
["Hire"]
["Pay Rate Change - Base Rate Increase"]
["Pay Rate Change - Adjustment"]
["Pay Rate Change - Bring to Minimum of Range"]
["Promotion to another Position"]
["Reporting Change"]
["Transfer - Voluntary Transfer"]
[]
[]
["All Available Action Reasons:"]
[]
["Benefit Status Change"]
["Change from NonBen to Benefit"]
["Change from Benefit to NonBen"]
[]
["Demotion - Involuntary"]
["Demotion - Return to Original Position"]
["Demotion - Voluntary Down Bid"]
[]
["Department Change"]
[]
["Encumbrance Change Only"]
[]
["Funding Change"]
[]
["Hire"]
{"$rows_left_out":72}
{"sheet":"Class","index":5,"n_rows":13,"n_cols":1,"rows_kept":13,"cut":false,"hidden":true,"merged":[]}
["Classified Hourly"]
["Dual Doc"]
["Faculty"]
["Graduate Employee"]
["Other"]
["Per Diem"]
["Post Doc"]
["Professional"]
["Resident"]
["Student"]
["Temporary Employee"]
["SHARE"]
["Post Retiree"]

{"sheet":"Type","index":6,"n_rows":2,"n_cols":1,"rows_kept":2,"cut":false,"hidden":true,"merged":[]}
["Regular"]
["Temporary"]

{"sheet":"Dept","index":7,"n_rows":649,"n_cols":2,"rows_kept":649,"cut":false,"hidden":true,"merged":[]}
["Department"]
["W116010 -Other Admin & Support"]
["W400000 -Chancellor"]
["W400010 -Chancellor Emeritus"]
["W400012 -Academic Recruitment"]
["W400013 -University  Expenses"]
["W400014 -Business Devlopmt & Innovation"]
["W400015 -Government Relations"]
["W400016 -Office of Management"]
["W400017 -GCA-Grants & Contracts Admin"]
["W400018 -Analytics CoE & Systems Suppt"]
["W400100 -Adv-Executive Office"]
["W400110 -Adv-Alumni Affairs"]
["W400112 -Adv-Annual Funds"]
["W400113 -Adv-Corp/Foundation Relatns"]
["W400114 -Adv-Central Admin/Operations"]
["W400120 -Adv-Cancer Walk"]
["W400130 -Adv-Planned Giving"]
["W400131 -Adv-Marlboro Hospital"]
["W400133 -Adv-Alumni & Parent Relations"]
["W400134 -Adv-Patience Assistance"]
["W400135 -Adv-Clinton Hospital"]
["W400136 -Adv-Events"]
["W400140 -Adv-Individual Giving"]
["W400141 -Adv-Advancement Services"]
["W400142 -Adv-Grateful Patient Program"]
["W400143 -Adv-Communication & Stewardshp"]
["W400145 -Adv-UMMMC Giving"]
["W400200 -Government Relations-UMMHC"]
["W400300 -Communications"]
{"$rows_left_out":620}
{"sheet":"Location","index":8,"n_rows":100,"n_cols":1,"rows_kept":100,"cut":false,"hidden":true,"merged":[]}
["ADOL UNITS"]
["AMBULATORY"]
["ANDERSON"]
["ASHBURTON"]
["ASHERMAN"]
["BAY MED CT"]
["BEACON ST"]
["BEHA BARN"]
["BEN BLDG"]
["BIO FIVE"]
["BIO FOUR"]
["BIO ONE"]
["BIO THREE"]
["BIO TWO"]
["BOYSGIRLS"]
["BROCKTON"]
["BRUDNICK"]
["BRYAN BLDG"]
["CARSON CTR"]
["CARVER"]
["CCNI"]
["CENTURY"]
["CERC"]
["CHANG"]
["CHELSEA"]
["CHINA TRAD"]
["CHL UMMCHL"]
["CLIN HOSP"]
["CLINIC"]
["COR MEN HT"]
{"$rows_left_out":71}
{"sheet":"Pay","index":9,"n_rows":2,"n_cols":1,"rows_kept":2,"cut":false,"hidden":true,"merged":[]}
["Hourly"]
["Bi-Weekly"]